{"text_format":"1","workbook":"xlsx","n_sheets":12,"sheets":["Output","Data","Names","Translate","Dimensions","Water","Oil","Propyleneglycol","Air-Dry","Methan","Propan","Butan"],"not_rendered":{"charts":8,"images":7,"macros":1,"external_links":1,"defined_names":49,"comments":0,"pivot_tables":0},"unopened":[],"bounds":{"document_bytes":16777216,"sheet_cells":100000,"rows_first":2000,"rows_last":500,"rows_between":2000,"halvings":0,"cell_chars":16384,"cell_head_chars":4096},"cells_cut":0,"cells_raw":0,"read":"whole","date_system":"1900"}

{"sheet":"Output","index":0,"n_rows":48,"n_cols":10,"rows_kept":48,"cut":false,"hidden":false,"merged":[[4,2,4,3],[5,2,5,3],[3,2,3,3],[43,1,43,9]]}
[]
[]
[]
[null,{"$f":"OFFSET(Translate!B73,0,moje3)","v":"Typ potrubí"},"Trubka Flexira xConnect"]
[null,{"$f":"OFFSET(Translate!B32,0,moje3)","v":"Rozměr potrubí"},"DN 15"]
[null,{"$f":"OFFSET(Translate!B4,0,moje3)","v":"Médium"},"Voda"]
[null,{"$f":"OFFSET(Translate!B6,0,moje3)","v":"Tlak (pouze u plynných médií) [Pa] "},2,"[kPa]"]
[null,{"$f":"OFFSET(Translate!B13,0,moje3)","v":"Délka Trubky [mm]"},1000,"[mm]"]
{"$rows_left_out":41}
{"sheet":"Data","index":1,"n_rows":656,"n_cols":12,"rows_kept":656,"cut":false,"hidden":true,"merged":[]}
[]
[]
[null,"Reynolds nr.","DN 08","DN 12","DN 15","DN 18","DN 20","DN 23","DN 25","DN 32","DN 40","DN 50"]
[null,0,0,0,0,0,0,0,0,0,0,0]
[null,100,{"$f":"64/$B5","v":0.64},0.64,0.64,0.64,0.64,0.64,0.64,0.64,0.64,0.64]
[null,200,0.32,0.32,0.32,0.32,0.32,0.32,0.32,0.32,0.32,0.32]
[null,300,0.21333333333333335,0.21333333333333335,0.21333333333333335,0.21333333333333335,0.21333333333333335,0.21333333333333335,0.21333333333333335,0.21333333333333335,0.21333333333333335,0.21333333333333335]
[null,400,0.16,0.16,0.16,0.16,0.16,0.16,0.16,0.16,0.16,0.16]
{"$rows_left_out":649}
{"sheet":"Names","index":2,"n_rows":13,"n_cols":28,"rows_kept":13,"cut":false,"hidden":true,"merged":[]}
[]
[]
[null,"Medium","aktuální",null,null,"Tube WR","číslo",null,"Hose WS","číslo",null,"Tube Cu","číslo",null,"Temperature",null,"Typ","aktuální","pom",null,"Languages","aktuální","pom",null,"Unit","aktuální","pom","Sloupec1"]
[null,{"$f":"OFFSET(Translate!B40,0,moje3)","v":"Voda"},{"$f":"1*IFERROR(MATCH(TabMedium[[#This Row],[Medium]],Output!$C$6,0),0)","v":1},null,null,{"$f":"TabWRFrictionF[[#Headers],[DN 08]]","v":"DN 08"},2,null,{"$f":"TabWSFrictionF[[#Headers],[DN 06]]","v":"DN 06"},2,null,{"$f":"TabCuFrictionF[[#Headers],[8x1]]","v":"8x1"},2,null,0,null,{"$f":"OFFSET(Translate!B69,0,TabJazyk[[#Totals],[pom]])","v":"Trubka Flexira xConnect"},{"$f":"IFERROR(MATCH(TabTyp[[#This Row],[Typ]],Output!$C$4,0),0)","v":1},{"$f":"TabTyp[[#This Row],[aktuální]]*1","v":1},null,"Česky",1,{"$f":"TabJazyk[[#This Row],[aktuální]]*1","v":1},null,"Pa",0,{"$f":"TabJednotka[[#This Row],[aktuální]]*1","v":0},{"$f":"TabJednotka[[#This Row],[aktuální]]*1","v":0}]
[null,{"$f":"OFFSET(Translate!B41,0,TabJazyk[[#Totals],[pom]])","v":"Olej"},{"$f":"2*IFERROR(MATCH(TabMedium[[#This Row],[Medium]],Output!$C$6,0),0)","v":0},null,null,{"$f":"TabWRFrictionF[[#Headers],[DN 12]]","v":"DN 12"},3,null,{"$f":"TabWSFrictionF[[#Headers],[DN 08]]","v":"DN 08"},3,null,{"$f":"TabCuFrictionF[[#Headers],[10x1]]","v":"10x1"},3,null,10,null,{"$f":"OFFSET(Translate!B70,0,TabJazyk[[#Totals],[pom]])","v":"Hadice WS"},{"$f":"IFERROR(MATCH(TabTyp[[#This Row],[Typ]],Output!$C$4,0),0)","v":0},{"$f":"TabTyp[[#This Row],[aktuální]]*2","v":0},null,"English",0,{"$f":"TabJazyk[[#This Row],[aktuální]]*2","v":0},null,"kPa",1,{"$f":"TabJednotka[[#This Row],[aktuální]]*1000","v":1000},{"$f":"TabJednotka[[#This Row],[aktuální]]*2","v":2}]
[null,{"$f":"OFFSET(Translate!B42,0,TabJazyk[[#Totals],[pom]])","v":"Vzduch"},{"$f":"3*IFERROR(MATCH(TabMedium[[#This Row],[Medium]],Output!$C$6,0),0)","v":0},null,null,{"$f":"TabWRFrictionF[[#Headers],[DN 15]]","v":"DN 15"},4,null,{"$f":"TabWSFrictionF[[#Headers],[DN 10]]","v":"DN 10"},4,null,{"$f":"TabCuFrictionF[[#Headers],[12x1]]","v":"12x1"},4,null,20,null,{"$f":"OFFSET(Translate!B71,0,TabJazyk[[#Totals],[pom]])","v":"Trubka Cu"},{"$f":"IFERROR(MATCH(TabTyp[[#This Row],[Typ]],Output!$C$4,0),0)","v":0},{"$f":"TabTyp[[#This Row],[aktuální]]*3","v":0},null,"Deutsch",0,{"$f":"TabJazyk[[#This Row],[aktuální]]*3","v":0},null,"MPa",0,{"$f":"TabJednotka[[#This Row],[aktuální]]*1000000","v":0},{"$f":"TabJednotka[[#This Row],[aktuální]]*3","v":0}]
[null,{"$f":"OFFSET(Translate!B43,0,TabJazyk[[#Totals],[pom]])","v":"Methan"},{"$f":"4*IFERROR(MATCH(TabMedium[[#This Row],[Medium]],Output!$C$6,0),0)","v":0},null,null,{"$f":"TabWRFrictionF[[#Headers],[DN 18]]","v":"DN 18"},5,null,{"$f":"TabWSFrictionF[[#Headers],[DN 12]]","v":"DN 12"},5,null,{"$f":"TabCuFrictionF[[#Headers],[15x1]]","v":"15x1"},5,null,30,null,null,null,{"$f":"SUBTOTAL(109,TabTyp[pom])","v":1},null,"по-русски",0,{"$f":"TabJazyk[[#This Row],[aktuální]]*4","v":0},null,"Bar",0,{"$f":"TabJednotka[[#This Row],[aktuální]]*100000","v":0},{"$f":"TabJednotka[[#This Row],[aktuální]]*4","v":0}]
[null,{"$f":"OFFSET(Translate!B44,0,TabJazyk[[#Totals],[pom]])","v":"Propan"},{"$f":"5*IFERROR(MATCH(TabMedium[[#This Row],[Medium]],Output!$C$6,0),0)","v":0},null,null,{"$f":"TabWRFrictionF[[#Headers],[DN 20]]","v":"DN 20"},6,null,{"$f":"TabWSFrictionF[[#Headers],[DN 15]]","v":"DN 15"},6,null,{"$f":"TabCuFrictionF[[#Headers],[18x1]]","v":"18x1"},6,null,40,null,null,null,null,null,null,null,{"$f":"MAX(TabJazyk[pom])-1","v":0},null,null,null,{"$f":"SUBTOTAL(109,TabJednotka[pom])","v":1000},{"$f":"SUBTOTAL(109,TabJednotka[Sloupec1])","v":2}]
{"$rows_left_out":6}
{"sheet":"Translate","index":3,"n_rows":77,"n_cols":5,"rows_kept":77,"cut":false,"hidden":true,"merged":[]}
[]
[]
[null,"Česky","English","Deutsch","по-русски"]
[null,"Médium","Medium","Mediun","Cреда"]
[null,"Cats","Cats","Cats","Cats"]
[null,"Tlak (pouze u plynných médií) [Pa] ","Pressure (only for gases) [Pa] *","Druck (nur für Gas) [Pa] *","Давление [Па] *"]
[null,"Teplota [°C]","Temperature [°C]","Temperatur [°C]","Температура [°C]"]
[null,"Vniřní průměr [mm]","Innen diametre [mm]","Innen Durchmesser [mm]","Внутренний диаметр [мм]"]
{"$rows_left_out":70}
{"sheet":"Dimensions","index":4,"n_rows":50,"n_cols":12,"rows_kept":50,"cut":false,"hidden":false,"merged":[]}
[]
[]
[null,null,"[mm]","[mm]","[mm]","[mm]","[kg/m]","  [m]","[m²/m]","[mm²/m]","[l/m]","[l]"]
[null,"Dimension","ØOD","ØID","Rozteč vln","Tloušťka stěny","Hmotnost","Délka rovné trubky pro výrobu 1m WR","Plocha","Plocha2","Objem","objem celé délky"]
[null,"DN 08",11.7,8.1,4.2,0.26,0.1,1.43,5.0225898390001453E-2,50225.89839000145,6.7799999999999999E-2,{"$f":"TabDimWR[[#This Row],[Objem]]*Output!$C$8/1000","v":6.7799999999999999E-2}]
[null,"DN 12",15.8,12,5,0.3,0.14000000000000001,1.27,6.0645304584897371E-2,60645.304584897371,0.13700000000000001,{"$f":"TabDimWR[[#This Row],[Objem]]*Output!$C$8/1000","v":0.13700000000000001}]
[null,"DN 15",20,15.7,5.5,0.3,0.18,1.3,7.9230966723534579E-2,79230.966723534584,0.23499999999999999,{"$f":"TabDimWR[[#This Row],[Objem]]*Output!$C$8/1000","v":0.23499999999999999}]
[null,"DN 18",21.6,17.899999999999999,5,0.26,0.17,1.28,8.4767709616221251E-2,84767.709616221255,0.2717,{"$f":"TabDimWR[[#This Row],[Objem]]*Output!$C$8/1000","v":0.2717}]
{"$rows_left_out":43}
{"sheet":"Water","index":5,"n_rows":50,"n_cols":7,"rows_kept":50,"cut":false,"hidden":true,"merged":[]}
["[°C]","[kg•m-3]","[m2•s-1]","[Pa•s]","[W•m-1•K-1]","[J•kg-1•K-1]"]
["Teplota","Hustota","Kinematická viskosita","Dynamická viskozita","Tepelná vodivost λ","Tepelná kapacita c","Součinitel teplotní rozt"]
[0,999.94100000000003,{"$f":"$D3/$B3","v":1.787105439220914E-6},{"$f":"1.787/1000","v":1.787E-3},0.56399999999999995,3397.4,1.8200000000000001E-4]
[10,999.70100000000002,1.3073909098820547E-6,{"$f":"1.307/1000","v":1.307E-3},0.58399999999999996,4176,1.95E-4]
[20,998.20500000000004,1.0038018242745728E-6,{"$f":"1.002/1000","v":1.0020000000000001E-3},0.59699999999999998,4178,2.1000000000000001E-4]
[30,995.65099999999995,8.014856611402992E-7,{"$f":"0.798/1000","v":7.9799999999999999E-4},0.61799999999999999,4179,{"$f":"((45+9.16*TabWater[[#This Row],[Teplota]]-0.019*TabWater[[#This Row],[Teplota]]^2))*0.000001","v":3.0269999999999999E-4}]
[40,992.22,6.5812017496119818E-7,{"$f":"0.653/1000","v":6.5300000000000004E-4},0.63100000000000001,4179,{"$f":"((45+9.16*TabWater[[#This Row],[Teplota]]-0.019*TabWater[[#This Row],[Teplota]]^2))*0.000001","v":3.8099999999999999E-4}]
[50,988.04,5.5362131087810221E-7,{"$f":"0.547/1000","v":5.4700000000000007E-4},0.64500000000000002,4182,{"$f":"((45+9.16*TabWater[[#This Row],[Teplota]]-0.019*TabWater[[#This Row],[Teplota]]^2))*0.000001","v":4.5549999999999996E-4}]
{"$rows_left_out":43}
{"sheet":"Oil","index":6,"n_rows":50,"n_cols":7,"rows_kept":50,"cut":false,"hidden":true,"merged":[]}
["[°C]","[kg•m-3]","[m2•s-1]","[Pa•s]","[W•m-1•K-1]","[J•kg-1•K-1]"]
["Teplota","Hustota","Kinematická viskosita","Dynamická viskozita","Tepelná vodivost λ","Tepelná kapacita c","Součinitel teplotní rozt"]
[0,852,{"$f":"0.0000072","v":7.1999999999999997E-6},{"$f":"TabOil[[#This Row],[Kinematická viskosita]]*TabOil[[#This Row],[Hustota]]","v":6.1343999999999999E-3},0.498,1842,8.0000000000000007E-5]
[10,850,{"$f":"0.0000055","v":5.4999999999999999E-6},{"$f":"TabOil[[#This Row],[Kinematická viskosita]]*TabOil[[#This Row],[Hustota]]","v":4.6749999999999995E-3},0.496,1885,8.0000000000000007E-5]
[20,848,3.9999999999999998E-6,{"$f":"TabOil[[#This Row],[Kinematická viskosita]]*TabOil[[#This Row],[Hustota]]","v":3.392E-3},0.49399999999999999,1926,8.0000000000000007E-5]
[30,845,3.0400000000000001E-6,{"$f":"TabOil[[#This Row],[Kinematická viskosita]]*TabOil[[#This Row],[Hustota]]","v":2.5688E-3},0.49199999999999999,1970,8.0000000000000007E-5]
[40,841,2.5000000000000002E-6,{"$f":"TabOil[[#This Row],[Kinematická viskosita]]*TabOil[[#This Row],[Hustota]]","v":2.1025000000000002E-3},0.48799999999999999,2010,8.0000000000000007E-5]
[50,835,1.9E-6,{"$f":"TabOil[[#This Row],[Kinematická viskosita]]*TabOil[[#This Row],[Hustota]]","v":1.5865E-3},0.48499999999999999,2051,8.0000000000000007E-5]
{"$rows_left_out":43}
{"sheet":"Propyleneglycol","index":7,"n_rows":50,"n_cols":7,"rows_kept":50,"cut":false,"hidden":true,"merged":[]}
["[°C]","[kg•m-3]","[m2•s-1]","[Pa•s]","[W•m-1•K-1]","[J•kg-1•K-1]"]
["Teplota","Hustota","Kinematická viskosita","Dynamická viskozita","Tepelná vodivost λ","Tepelná kapacita c","Součinitel teplotní rozt"]
[0,{"$f":"ROUND(+$B$15+$C$15*A3+$D$15*A3*A3,1)","v":1057.4000000000001},{"$f":"10^($B$14+$C$14*A3+$D$14*A3*A3)*0.000001","v":1.9873956304777179E-5},{"$f":"TabMPG[[#This Row],[Hustota]]*TabMPG[[#This Row],[Kinematická viskosita]]","v":2.101472139667139E-2},0.32,3397.4,1.8200000000000001E-4]
[10,1051.8,1.1679264786354632E-5,{"$f":"TabMPG[[#This Row],[Hustota]]*TabMPG[[#This Row],[Kinematická viskosita]]","v":1.2284250702287803E-2},0.3392,3438.2930000000001,1.95E-4]
[20,1046,7.1992456774953771E-6,{"$f":"TabMPG[[#This Row],[Hustota]]*TabMPG[[#This Row],[Kinematická viskosita]]","v":7.5304109786601646E-3},0.35804999999999998,3479.1860000000001,2.1000000000000001E-4]
[30,1039.9000000000001,4.6547761412520097E-6,{"$f":"TabMPG[[#This Row],[Hustota]]*TabMPG[[#This Row],[Kinematická viskosita]]","v":4.8405017092879657E-3},0.37690000000000001,3520.0790000000002,{"$f":"((45+9.16*TabWater[[#This Row],[Teplota]]-0.019*TabWater[[#This Row],[Teplota]]^2))*0.000001","v":3.0269999999999999E-4}]
[40,1033.5,3.1568280042549221E-6,{"$f":"TabMPG[[#This Row],[Hustota]]*TabMPG[[#This Row],[Kinematická viskosita]]","v":3.2625817423974622E-3},0.39575000000000005,3560.9720000000002,{"$f":"((45+9.16*TabWater[[#This Row],[Teplota]]-0.019*TabWater[[#This Row],[Teplota]]^2))*0.000001","v":3.8099999999999999E-4}]
[50,1026.9000000000001,2.245656658581561E-6,{"$f":"TabMPG[[#This Row],[Hustota]]*TabMPG[[#This Row],[Kinematická viskosita]]","v":2.306064822697405E-3},0.41460000000000008,3601.8650000000002,{"$f":"((45+9.16*TabWater[[#This Row],[Teplota]]-0.019*TabWater[[#This Row],[Teplota]]^2))*0.000001","v":4.5549999999999996E-4}]
{"$rows_left_out":43}
{"sheet":"Air-Dry","index":8,"n_rows":50,"n_cols":12,"rows_kept":50,"cut":false,"hidden":true,"merged":[]}
["[°C]","[kg•m-3]","[kg•m-3]","[m2•s-1]","[Pa•s]","[W•m-1•K-1]","[J•kg-1•K-1]","[-]"]
["Teplota","Hustota P0","Hustota P1","Kinematická viskosita","Dynamická viskozita","Tepelná vodivost λ","Tepelná kapacita c","Pr",null,"Tlak P1 [Pa]",{"$f":"Tlak*1000+100000","v":102000},"Pa"]
[0,1.2749999999999999,{"$f":"$B3*($K$2/100000)","v":1.3005},{"$f":"TabAir[[#This Row],[Dynamická viskozita]]/TabAir[[#This Row],[Hustota P1]]","v":1.3156478277585545E-5},{"$f":"(0.000000002*A3^3-0.000004*A3^2+0.0049*A3+1.711)/100000","v":1.7110000000000001E-5},2.3699999999999999E-2,1005,{"$f":"TabAir[[#This Row],[Tepelná kapacita c]]*TabAir[[#This Row],[Dynamická viskozita]]/TabAir[[#This Row],[Tepelná vodivost λ]]","v":0.72555063291139243}]
[10,1.23,1.2545999999999999,{"$f":"TabAir[[#This Row],[Dynamická viskozita]]/TabAir[[#This Row],[Hustota P1]]","v":1.4025203252032521E-5},1.759602E-5,2.4500000000000001E-2,1005,{"$f":"TabAir[[#This Row],[Tepelná kapacita c]]*TabAir[[#This Row],[Dynamická viskozita]]/TabAir[[#This Row],[Tepelná vodivost λ]]","v":0.7217959224489795}]
[20,1.1879999999999999,1.2117599999999999,{"$f":"TabAir[[#This Row],[Dynamická viskozita]]/TabAir[[#This Row],[Hustota P1]]","v":1.4915626856803329E-5},1.8074160000000001E-5,2.52E-2,1010,{"$f":"TabAir[[#This Row],[Tepelná kapacita c]]*TabAir[[#This Row],[Dynamická viskozita]]/TabAir[[#This Row],[Tepelná vodivost λ]]","v":0.72440085714285718}]
[30,1.1466000000000001,1.169532,{"$f":"TabAir[[#This Row],[Dynamická viskozita]]/TabAir[[#This Row],[Hustota P1]]","v":1.5856376738729682E-5},1.8544540000000001E-5,2.5950000000000001E-2,1011.5,{"$f":"TabAir[[#This Row],[Tepelná kapacita c]]*TabAir[[#This Row],[Dynamická viskozita]]/TabAir[[#This Row],[Tepelná vodivost λ]]","v":0.72284401579961466}]
[40,1.1120000000000001,1.1342400000000001,{"$f":"TabAir[[#This Row],[Dynamická viskozita]]/TabAir[[#This Row],[Hustota P1]]","v":1.6757723233178159E-5},1.9007279999999999E-5,2.6499999999999999E-2,1013,{"$f":"TabAir[[#This Row],[Tepelná kapacita c]]*TabAir[[#This Row],[Dynamická viskozita]]/TabAir[[#This Row],[Tepelná vodivost λ]]","v":0.72658017509433959}]
[50,1.08,1.1016000000000001,{"$f":"TabAir[[#This Row],[Dynamická viskozita]]/TabAir[[#This Row],[Hustota P1]]","v":1.7667483660130716E-5},1.9462499999999999E-5,2.725E-2,1015,{"$f":"TabAir[[#This Row],[Tepelná kapacita c]]*TabAir[[#This Row],[Dynamická viskozita]]/TabAir[[#This Row],[Tepelná vodivost λ]]","v":0.72493348623853204}]
{"$rows_left_out":43}
{"sheet":"Methan","index":9,"n_rows":50,"n_cols":12,"rows_kept":50,"cut":false,"hidden":true,"merged":[]}
["[°C]","[kg•m-3]","[kg•m-3]","[m2•s-1]","[Pa•s]","[W•m-1•K-1]","[J•kg-1•K-1]","[-]"]
["Teplota","Hustota P0","Hustota P1","Kinematická viskosita","Dynamická viskozita","Tepelná vodivost λ","Tepelná kapacita c","Pr",null,"Tlak P1 [Pa]",{"$f":"Tlak*1000+100000","v":102000},"Pa"]
[0,0.73,{"$f":"$B3*($K$2/100000)","v":0.74460000000000004},{"$f":"TabMathan[[#This Row],[Dynamická viskozita]]/TabMathan[[#This Row],[Hustota P1]]","v":1.415525114155251E-5},{"$f":"10.54/1000000","v":1.0539999999999999E-5},null,null,null,null,"Spalné teplo",39.9,"MJ/m3"]
[10,0.70399999999999996,0.71807999999999994,{"$f":"TabMathan[[#This Row],[Dynamická viskozita]]/TabMathan[[#This Row],[Hustota P1]]","v":1.5081885026737968E-5},{"$f":"10.83/1000000","v":1.083E-5},null,null,null,null,"Výhřevnost",35.9,"MJ/m3"]
[20,0.68,0.69360000000000011,{"$f":"TabMathan[[#This Row],[Dynamická viskozita]]/TabMathan[[#This Row],[Hustota P1]]","v":1.6032295271049593E-5},{"$f":"11.12/1000000","v":1.1119999999999999E-5}]
[30,0.65800000000000003,0.67116000000000009,{"$f":"TabMathan[[#This Row],[Dynamická viskozita]]/TabMathan[[#This Row],[Hustota P1]]","v":1.7000417188151856E-5},{"$f":"11.41/1000000","v":1.1410000000000001E-5}]
[40,0.63700000000000001,0.64973999999999998,{"$f":"TabMathan[[#This Row],[Dynamická viskozita]]/TabMathan[[#This Row],[Hustota P1]]","v":1.8007202881152462E-5},{"$f":"11.7/1000000","v":1.17E-5}]
[50,0.61699999999999999,0.62934000000000001,{"$f":"TabMathan[[#This Row],[Dynamická viskozita]]/TabMathan[[#This Row],[Hustota P1]]","v":1.9035815298566753E-5},{"$f":"11.98/1000000","v":1.198E-5}]
{"$rows_left_out":43}
{"sheet":"Propan","index":10,"n_rows":50,"n_cols":12,"rows_kept":50,"cut":false,"hidden":true,"merged":[]}
["[°C]","[kg•m-3]","[kg•m-3]","[m2•s-1]","[Pa•s]","[W•m-1•K-1]","[J•kg-1•K-1]","[-]"]
["Teplota","Hustota P0","Hustota P1","Kinematická viskosita","Dynamická viskozita","Tepelná vodivost λ","Tepelná kapacita c","Pr",null,"Tlak P1 [Pa]",{"$f":"Tlak*1000+100000","v":102000},"Pa"]
[0,1.9832000000000001,{"$f":"$B3*($K$2/100000)","v":2.0228640000000002},{"$f":"TabPropan[[#This Row],[Dynamická viskozita]]/TabPropan[[#This Row],[Hustota P1]]","v":3.6925369179539503E-6},{"$f":"7.4695/1000000","v":7.4695000000000002E-6},null,null,{"$f":"IFERROR(TabPropan[[#This Row],[Tepelná kapacita c]]*TabPropan[[#This Row],[Dynamická viskozita]]/TabPropan[[#This Row],[Tepelná vodivost λ]],\"\")","v":""},null,"Spalné teplo",101,"MJ/m3"]
[10,1.9087000000000001,1.946874,{"$f":"TabPropan[[#This Row],[Dynamická viskozita]]/TabPropan[[#This Row],[Hustota P1]]","v":3.9762203409157449E-6},{"$f":"7.7412/1000000","v":7.7411999999999997E-6},null,null,{"$f":"IFERROR(TabPropan[[#This Row],[Tepelná kapacita c]]*TabPropan[[#This Row],[Dynamická viskozita]]/TabPropan[[#This Row],[Tepelná vodivost λ]],\"\")","v":""},null,"Výhřevnost",93.2,"MJ/m3"]
[20,1.84,1.8768,{"$f":"TabPropan[[#This Row],[Dynamická viskozita]]/TabPropan[[#This Row],[Hustota P1]]","v":4.2687553282182434E-6},{"$f":"8.0116/1000000","v":8.0115999999999997E-6},null,null,{"$f":"IFERROR(TabPropan[[#This Row],[Tepelná kapacita c]]*TabPropan[[#This Row],[Dynamická viskozita]]/TabPropan[[#This Row],[Tepelná vodivost λ]],\"\")","v":""}]
[30,1.7763,1.8118259999999999,{"$f":"TabPropan[[#This Row],[Dynamická viskozita]]/TabPropan[[#This Row],[Hustota P1]]","v":4.5704168060288344E-6},{"$f":"8.2808/1000000","v":8.2807999999999987E-6},null,null,{"$f":"IFERROR(TabPropan[[#This Row],[Tepelná kapacita c]]*TabPropan[[#This Row],[Dynamická viskozita]]/TabPropan[[#This Row],[Tepelná vodivost λ]],\"\")","v":""}]
[40,1.7170000000000001,1.7513400000000001,{"$f":"TabPropan[[#This Row],[Dynamická viskozita]]/TabPropan[[#This Row],[Hustota P1]]","v":4.8812908972558155E-6},{"$f":"8.5488/1000000","v":8.5488000000000002E-6},null,null,{"$f":"IFERROR(TabPropan[[#This Row],[Tepelná kapacita c]]*TabPropan[[#This Row],[Dynamická viskozita]]/TabPropan[[#This Row],[Tepelná vodivost λ]],\"\")","v":""}]
[50,1.6617,1.6949339999999999,{"$f":"TabPropan[[#This Row],[Dynamická viskozita]]/TabPropan[[#This Row],[Hustota P1]]","v":5.2010284766250487E-6},{"$f":"8.8154/1000000","v":8.8154000000000003E-6},null,null,{"$f":"IFERROR(TabPropan[[#This Row],[Tepelná kapacita c]]*TabPropan[[#This Row],[Dynamická viskozita]]/TabPropan[[#This Row],[Tepelná vodivost λ]],\"\")","v":""}]
{"$rows_left_out":43}
{"sheet":"Butan","index":11,"n_rows":50,"n_cols":12,"rows_kept":50,"cut":false,"hidden":true,"merged":[]}
["[°C]","[kg•m-3]","[kg•m-3]","[m2•s-1]","[Pa•s]","[W•m-1•K-1]","[J•kg-1•K-1]","[-]"]
["Teplota","Hustota P0","Hustota P1","Kinematická viskosita","Dynamická viskozita","Tepelná vodivost λ","Tepelná kapacita c","Pr",null,"Tlak P1 [Pa]",{"$f":"Tlak*1000+100000","v":102000},"Pa"]
[0,2.6667999999999998,{"$f":"$B3*($K$2/100000)","v":2.7201359999999997},{"$f":"TabButan[[#This Row],[Dynamická viskozita]]/TabButan[[#This Row],[Hustota P1]]","v":2.4886623315893031E-6},{"$f":"6.7695/1000000","v":6.7695000000000002E-6},null,null,{"$f":"IFERROR(TabButan[[#This Row],[Tepelná kapacita c]]*TabButan[[#This Row],[Dynamická viskozita]]/TabButan[[#This Row],[Tepelná vodivost λ]],\"\")","v":""},null,"Spalné teplo",134,"MJ/m3"]
[10,2.5596999999999999,2.610894,{"$f":"TabButan[[#This Row],[Dynamická viskozita]]/TabButan[[#This Row],[Hustota P1]]","v":2.6908790628803773E-6},{"$f":"7.0256/1000000","v":7.0256000000000001E-6},null,null,{"$f":"IFERROR(TabButan[[#This Row],[Tepelná kapacita c]]*TabButan[[#This Row],[Dynamická viskozita]]/TabButan[[#This Row],[Tepelná vodivost λ]],\"\")","v":""},null,"Výhřevnost",123,"MJ/m3"]
[20,2.4620000000000002,2.5112400000000004,{"$f":"TabButan[[#This Row],[Dynamická viskozita]]/TabButan[[#This Row],[Hustota P1]]","v":2.8987273219604653E-6},{"$f":"7.2794/1000000","v":7.2794000000000001E-6},null,null,{"$f":"IFERROR(TabButan[[#This Row],[Tepelná kapacita c]]*TabButan[[#This Row],[Dynamická viskozita]]/TabButan[[#This Row],[Tepelná vodivost λ]],\"\")","v":""}]
[30,2.3723000000000001,2.419746,{"$f":"TabButan[[#This Row],[Dynamická viskozita]]/TabButan[[#This Row],[Hustota P1]]","v":3.1124341149856227E-6},{"$f":"7.5313/1000000","v":7.5313000000000002E-6},null,null,{"$f":"IFERROR(TabButan[[#This Row],[Tepelná kapacita c]]*TabButan[[#This Row],[Dynamická viskozita]]/TabButan[[#This Row],[Tepelná vodivost λ]],\"\")","v":""}]
[40,2.2896000000000001,2.3353920000000001,{"$f":"TabButan[[#This Row],[Dynamická viskozita]]/TabButan[[#This Row],[Hustota P1]]","v":3.3319888053054905E-6},{"$f":"7.7815/1000000","v":7.7815E-6},null,null,{"$f":"IFERROR(TabButan[[#This Row],[Tepelná kapacita c]]*TabButan[[#This Row],[Dynamická viskozita]]/TabButan[[#This Row],[Tepelná vodivost λ]],\"\")","v":""}]
[50,2.2130000000000001,2.25726,{"$f":"TabButan[[#This Row],[Dynamická viskozita]]/TabButan[[#This Row],[Hustota P1]]","v":3.5574546131150155E-6},{"$f":"8.0301/1000000","v":8.0300999999999996E-6},null,null,{"$f":"IFERROR(TabButan[[#This Row],[Tepelná kapacita c]]*TabButan[[#This Row],[Dynamická viskozita]]/TabButan[[#This Row],[Tepelná vodivost λ]],\"\")","v":""}]
{"$rows_left_out":42}